Reaction Details
TargetTranslocator protein
LigandBDBM50430887
Substrate/Competitorn/a
Meas. Tech.ChEMBL_945907 (CHEMBL2340521)
Ki 68±n/a nM
Citation Tang, DMcKinley, ETHight, MRUddin, MIHarp, JMFu, ANickels, MLBuck, JRManning, HC Synthesis and structure-activity relationships of 5,6,7-substituted pyrazolopyrimidines: discovery of a novel TSPO PET ligand for cancer imaging. J Med Chem56:3429-33 (2013) 
 
Translocator protein
Name:Translocator protein
Type:Mitochondrion membrane protein
Mol. Mass.:18945.84
Organism:Rattus norvegicus (rat)
Description:Competitive binding experiments were performed on rat kidney mitochondrial membranes.
Residue:169
BDBM50430887
NameBDBM50430887
Synonyms:CHEMBL2336479
TypeSmall organic molecule
Emp. Form.C22H26ClFN4O2
Mol. Mass.432.919
SMILESCCN(CC)C(=O)Cc1c(nn2c(C)c(Cl)c(C)nc12)-c1ccc(OCCF)cc1