Reaction Details
TargetMAP kinase-activated protein kinase 2
LigandBDBM50431029
Substrate/Competitorn/a
Meas. Tech.ChEMBL_947327 (CHEMBL2344111)
IC50 6700±n/a nM
Citation Brown, AShi, QMoore, TWYoon, YPrussia, AMaddox, CLiotta, DCShim, HSnyder, JP Monocarbonyl curcumin analogues: heterocyclic pleiotropic kinase inhibitors that mediate anticancer properties. J Med Chem56:3456-66 (2013) 
 
MAP kinase-activated protein kinase 2
Name:MAP kinase-activated protein kinase 2
Type:Serine/threonine-protein kinase
Mol. Mass.:45579.87
Organism:Homo sapiens (Human)
Description:P49137
Residue:400
BDBM50431029
NameBDBM50431029
Synonyms:CHEMBL574646
TypeSmall organic molecule
Emp. Form.C17H15N3O
Mol. Mass.277.3205
SMILESO=C1\C(CNC\C1=C/c1ccccn1)=C\c1ccccn1