Reaction Details
TargetSerine/threonine-protein kinase Nek1
LigandBDBM50431029
Substrate/Competitorn/a
Meas. Tech.ChEMBL_947331 (CHEMBL2344115)
IC50 500±n/a nM
Citation Brown, AShi, QMoore, TWYoon, YPrussia, AMaddox, CLiotta, DCShim, HSnyder, JP Monocarbonyl curcumin analogues: heterocyclic pleiotropic kinase inhibitors that mediate anticancer properties. J Med Chem56:3456-66 (2013) 
 
Serine/threonine-protein kinase Nek1
Name:Serine/threonine-protein kinase Nek1
Type:Protein
Mol. Mass.:142810.07
Organism:Homo sapiens (Human)
Description:n/a
Residue:1258
BDBM50431029
NameBDBM50431029
Synonyms:CHEMBL574646
TypeSmall organic molecule
Emp. Form.C17H15N3O
Mol. Mass.277.3205
SMILESO=C1\C(CNC\C1=C/c1ccccn1)=C\c1ccccn1