Reaction Details
TargetD-amino-acid oxidase
LigandBDBM50431070
Substrate/Competitorn/a
Meas. Tech.ChEMBL_947859 (CHEMBL2343135)
IC50 2.2±n/a nM
Citation Hondo, TWarizaya, MNiimi, TNamatame, IYamaguchi, TNakanishi, KHamajima, THarada, KSakashita, HMatsumoto, YOrita, MTakeuchi, M 4-Hydroxypyridazin-3(2H)-one derivatives as novel D-amino acid oxidase inhibitors. J Med Chem56:3582-92 (2013) 
 
D-amino-acid oxidase
Name:D-amino-acid oxidase
Type:Homodimer
Mol. Mass.:39476.06
Organism:Homo sapiens (Human)
Description:P14920
Residue:347
BDBM50431070
NameBDBM50431070
Synonyms:CHEMBL2338794
TypeSmall organic molecule
Emp. Form.C11H10N2O3
Mol. Mass.218.2087
SMILESOc1cc(COc2ccccc2)n[nH]c1=O