Reaction Details
TargetNAD-dependent protein deacetylase sirtuin-1
LigandBDBM50431114
Substrate/Competitorn/a
Meas. Tech.ChEMBL_948318 (CHEMBL2341152)
IC50 110±n/a nM
Citation Disch, JSEvindar, GChiu, CHBlum, CADai, HJin, LSchuman, ELind, KEBelyanskaya, SLDeng, JCoppo, FAquilani, LGraybill, TLCuozzo, JWLavu, SMao, CVlasuk, GPPerni, RB Discovery of thieno[3,2-d]pyrimidine-6-carboxamides as potent inhibitors of SIRT1, SIRT2, and SIRT3. J Med Chem56:3666-79 (2013) 
 
NAD-dependent protein deacetylase sirtuin-1
Name:NAD-dependent protein deacetylase sirtuin-1
Type:Developmental protein; hydrolase
Mol. Mass.:81626.66
Organism:Homo sapiens (Human)
Description:n/a
Residue:747
BDBM50431114
NameBDBM50431114
Synonyms:CHEMBL2332045
TypeSmall organic molecule
Emp. Form.C16H21N5O2S
Mol. Mass.347.435
SMILESCC(=O)NCCC1CCN(CC1)c1ncnc2cc(sc12)C(N)=O