Reaction Details
TargetSarcoplasmic/endoplasmic reticulum calcium ATPase 1
LigandBDBM50431167
Substrate/Competitorn/a
Meas. Tech.ChEMBL_948355 (CHEMBL2341189)
Kd 79±n/a nM
Citation Paulsen, ESVilladsen, JTenori, ELiu, HBonde, DFLie, MABublitz, MOlesen, CAutzen, HEDach, ISehgal, PNissen, PMøller, JVSchiøtt, BChristensen, SB Water-mediated interactions influence the binding of thapsigargin to sarco/endoplasmic reticulum calcium adenosinetriphosphatase. J Med Chem56:3609-19 (2013) 
 
Sarcoplasmic/endoplasmic reticulum calcium ATPase 1
Name:Sarcoplasmic/endoplasmic reticulum calcium ATPase 1
Type:PROTEIN
Mol. Mass.:110435.34
Organism:Oryctolagus cuniculus
Description:ChEMBL_1500621
Residue:1001
BDBM50431167
NameBDBM50431167
Synonyms:CHEMBL2332553
TypeSmall organic molecule
Emp. Form.C39H59NO12
Mol. Mass.733.8853
SMILESCCCCCCCC(=O)O[C@@H]1[C@@H](OC(=O)C(\C)=C/C)C(C)=C2[C@@H]3O[C@H]4N=C(CCOCC)O[C@@]4(C)[C@@]3(O)[C@H](C[C@](C)(OC(C)=O)[C@@H]12)OC(=O)CCC