Reaction Details
TargetSarcoplasmic/endoplasmic reticulum calcium ATPase 1
LigandBDBM50431174
Substrate/Competitorn/a
Meas. Tech.ChEMBL_948355 (CHEMBL2341189)
Kd 8.5±n/a nM
Citation Paulsen, ESVilladsen, JTenori, ELiu, HBonde, DFLie, MABublitz, MOlesen, CAutzen, HEDach, ISehgal, PNissen, PMøller, JVSchiøtt, BChristensen, SB Water-mediated interactions influence the binding of thapsigargin to sarco/endoplasmic reticulum calcium adenosinetriphosphatase. J Med Chem56:3609-19 (2013) 
 
Sarcoplasmic/endoplasmic reticulum calcium ATPase 1
Name:Sarcoplasmic/endoplasmic reticulum calcium ATPase 1
Type:PROTEIN
Mol. Mass.:110435.34
Organism:Oryctolagus cuniculus
Description:ChEMBL_1500621
Residue:1001
BDBM50431174
NameBDBM50431174
Synonyms:CHEMBL2332101
TypeSmall organic molecule
Emp. Form.C40H60O13
Mol. Mass.748.8966
SMILESCCCCCCCC(=O)O[C@@H]1[C@@H](OC(=O)C(\C)=C/C)C(C)=C2[C@@H]3OC(=O)[C@@](C)(O)[C@@]3(OC(=O)CCCCC)[C@H](C[C@](C)(OC(C)=O)[C@@H]12)OC(=O)CCC