Reaction Details
TargetMyc proto-oncogene protein
LigandBDBM50431277
Substrate/Competitorn/a
Meas. Tech.ChEMBL_950755 (CHEMBL2353444)
IC50 60000±n/a nM
Citation Zaki, MABalachandran, PKhan, SWang, MMohammed, RHetta, MHPasco, DSMuhammad, I Cytotoxicity and modulation of cancer-related signaling by (Z)- and (E)-3,4,3',5'-tetramethoxystilbene isolated from Eugenia rigida. J Nat Prod76:679-84 (2013) 
 
Myc proto-oncogene protein
Name:Myc proto-oncogene protein
Type:PROTEIN
Mol. Mass.:48794.95
Organism:Homo sapiens (Human)
Description:ChEMBL_935266
Residue:439
BDBM50431277
NameBDBM50431277
Synonyms:(Z)-3,4,3'',5''-Tetramethoxystilbene (Z)-3,5,30,40-Tetramethoxystilbene
TypeSmall organic molecule
Emp. Form.C18H20O4
Mol. Mass.300.349
SMILESCOc1cc(OC)cc(\C=C/c2ccc(OC)c(OC)c2)c1