Reaction Details
TargetCyclin-dependent kinase/G2/mitotic-specific cyclin- 1
LigandBDBM50431349
Substrate/Competitorn/a
Meas. Tech.ChEMBL_954062 (CHEMBL2350830)
Ki 18±n/a nM
Citation Shao, HShi, SHuang, SHole, AJAbbas, AYBaumli, SLiu, XLam, FFoley, DWFischer, PMNoble, MEndicott, JAPepper, CWang, S Substituted 4-(thiazol-5-yl)-2-(phenylamino)pyrimidines are highly active CDK9 inhibitors: synthesis, X-ray crystal structures, structure-activity relationship, and anticancer activities. J Med Chem56:640-59 (2013) 
 
Cyclin-dependent kinase/G2/mitotic-specific cyclin- 1
Name:Cyclin-dependent kinase/G2/mitotic-specific cyclin- 1
Type:Protein Complex
Mol. Mass.:n/a
Description:CDK1/Cyclin B complexes were purified from insect cells co-infected with baculovirus vectors containing each of the components.
Components:This complex has 2 components.
Component 1
Name:Cyclin-dependent kinase 1
Synonyms:CDC2 CDK1 CDKN1 Cell division protein kinase 1 P34CDC2 | p34 protein kinase
Type:Enzyme Subunit
Mol. Mass.:34101.08
Organism:Homo sapiens (Human)
Description:P06493
Residue:297
Component 2
Name:G2/mitotic-specific cyclin-B1
Synonyms:CCNB CCNB1_HUMAN
Type:Enzyme Subunit
Mol. Mass.:48340.95
Organism:Homo sapiens (Human)
Description:P14635
Residue:433
BDBM50431349
NameBDBM50431349
Synonyms:CHEMBL2348648
TypeSmall organic molecule
Emp. Form.C19H21FN6OS
Mol. Mass.400.473
SMILESCNc1nc(C)c(s1)-c1nc(Nc2cccc(c2)N2CCOCC2)ncc1F