Reaction Details
TargetProstaglandin E synthase
LigandBDBM50431407
Substrate/Competitorn/a
Meas. Tech.ChEMBL_952397 (CHEMBL2352763)
IC50 226±n/a nM
Citation Shiro, TKakiguchi, KTakahashi, HNagata, HTobe, M Synthesis and biological evaluation of substituted imidazoquinoline derivatives as mPGES-1 inhibitors. Bioorg Med Chem21:2068-78 (2013) 
 
Prostaglandin E synthase
Name:Prostaglandin E synthase
Type:Protein
Mol. Mass.:17112.22
Organism:Homo sapiens (Human)
Description:n/a
Residue:152
BDBM50431407
NameBDBM50431407
Synonyms:CHEMBL2348044
TypeSmall organic molecule
Emp. Form.C23H15BrClN3O
Mol. Mass.464.742
SMILESClc1ccccc1-c1nc2c([nH]1)c(=O)n(Cc1ccccc1)c1cc(Br)ccc21