Reaction Details
TargetRibonucleoside-diphosphate reductase subunit alpha
LigandBDBM50431417
Substrate/Competitorn/a
Meas. Tech.ChEMBL_952415 (CHEMBL2352781)
Kd 8100±n/a nM
Citation Nurbo, JEricsson, DJRosenström, UMuthas, DJansson, AMLindeberg, GUnge, TKarlén, A Novel pseudopeptides incorporating a benzodiazepine-based turn mimetic--targeting Mycobacterium tuberculosis ribonucleotide reductase. Bioorg Med Chem21:1992-2000 (2013) 
 
Ribonucleoside-diphosphate reductase subunit alpha
Name:Ribonucleoside-diphosphate reductase subunit alpha
Type:PROTEIN
Mol. Mass.:82438.64
Organism:Mycobacterium tuberculosis
Description:ChEMBL_952415
Residue:725
BDBM50431417
NameBDBM50431417
Synonyms:CHEMBL2348059
TypeSmall organic molecule
Emp. Form.C35H30N4O5
Mol. Mass.586.6365
SMILESOC(=O)CN1Cc2cccc(NC(=O)OCC3c4ccccc4-c4ccccc34)c2N[C@@H](Cc2c[nH]c3ccccc23)C1=O