Reaction Details
TargetRibonucleoside-diphosphate reductase subunit alpha
LigandBDBM50431418
Substrate/Competitorn/a
Meas. Tech.ChEMBL_952415 (CHEMBL2352781)
Kd 1600±n/a nM
Citation Nurbo, JEricsson, DJRosenström, UMuthas, DJansson, AMLindeberg, GUnge, TKarlén, A Novel pseudopeptides incorporating a benzodiazepine-based turn mimetic--targeting Mycobacterium tuberculosis ribonucleotide reductase. Bioorg Med Chem21:1992-2000 (2013) 
 
Ribonucleoside-diphosphate reductase subunit alpha
Name:Ribonucleoside-diphosphate reductase subunit alpha
Type:PROTEIN
Mol. Mass.:82438.64
Organism:Mycobacterium tuberculosis
Description:ChEMBL_952415
Residue:725
BDBM50431418
NameBDBM50431418
Synonyms:CHEMBL2348058
TypeSmall organic molecule
Emp. Form.C48H44N6O9
Mol. Mass.848.8978
SMILESOC(=O)C[C@H](NC(=O)OCC1c2ccccc2-c2ccccc12)C(=O)Nc1cccc2CN(CC(=O)N[C@@H](Cc3ccccc3)C(O)=O)C(=O)[C@H](Cc3c[nH]c4ccccc34)Nc12