Reaction Details
TargetRibonucleoside-diphosphate reductase subunit alpha
LigandBDBM50431420
Substrate/Competitorn/a
Meas. Tech.ChEMBL_952415 (CHEMBL2352781)
Kd 27000±n/a nM
Citation Nurbo, JEricsson, DJRosenström, UMuthas, DJansson, AMLindeberg, GUnge, TKarlén, A Novel pseudopeptides incorporating a benzodiazepine-based turn mimetic--targeting Mycobacterium tuberculosis ribonucleotide reductase. Bioorg Med Chem21:1992-2000 (2013) 
 
Ribonucleoside-diphosphate reductase subunit alpha
Name:Ribonucleoside-diphosphate reductase subunit alpha
Type:PROTEIN
Mol. Mass.:82438.64
Organism:Mycobacterium tuberculosis
Description:ChEMBL_952415
Residue:725
BDBM50431420
NameBDBM50431420
Synonyms:CHEMBL2348056
TypeSmall organic molecule
Emp. Form.C48H53N9O17
Mol. Mass.1027.9845
SMILESCC(=O)N[C@@H](CCC(O)=O)C(=O)N[C@@H](CC(O)=O)C(=O)N[C@@H](CC(O)=O)C(=O)N[C@@H](CC(O)=O)C(=O)Nc1cccc2CN(CC(=O)N[C@@H](Cc3ccccc3)C(O)=O)C(=O)[C@H](Cc3c[nH]c4ccccc34)Nc12