Reaction Details
TargetProliferating cell nuclear antigen
LigandBDBM18864
Substrate/Competitorn/a
Meas. Tech.ChEMBL_952429 (CHEMBL2352795)
IC50 17000±n/a nM
Citation Actis, MInoue, AEvison, BPerry, SPunchihewa, CFujii, N Small molecule inhibitors of PCNA/PIP-box interaction suppress translesion DNA synthesis. Bioorg Med Chem21:1972-7 (2013) 
 
Proliferating cell nuclear antigen
Name:Proliferating cell nuclear antigen
Type:PROTEIN
Mol. Mass.:28752.86
Organism:Homo sapiens (Human)
Description:ChEMBL_952429
Residue:261
BDBM18864
NameBDBM18864
Synonyms:3-[4-(4-hydroxy-3-iodophenoxy)-3,5-diiodophenyl]propanoic acid cid_5804 | triiodothyropropionic acid, 5
TypeSmall organic molecule
Emp. Form.C15H11I3O4
Mol. Mass.635.9589
SMILESOC(=O)CCc1cc(I)c(Oc2ccc(O)c(I)c2)c(I)c1