Reaction Details
TargetAminopeptidase N
LigandBDBM50353018
Substrate/Competitorn/a
Meas. Tech.ChEMBL_951229 (CHEMBL2353230)
Ki 0.350000±n/a nM
Citation Schmitt, CVoegelin, MMarin, ASchmitt, MSchegg, FHénon, PGuenot, DTarnus, C Selective aminopeptidase-N (CD13) inhibitors with relevance to cancer chemotherapy. Bioorg Med Chem21:2135-44 (2013) 
 
Aminopeptidase N
Name:Aminopeptidase N
Type:PROTEIN
Mol. Mass.:109522.63
Organism:Homo sapiens (Human)
Description:ChEMBL_1507526
Residue:967
BDBM50353018
NameBDBM50353018
Synonyms:CHEMBL1821980 | CHEMBL1852660
TypeSmall organic molecule
Emp. Form.C17H16BrNO
Mol. Mass.330.219
SMILESNC1CCc2c(Br)ccc(-c3ccccc3)c2CC1=O