Reaction Details
TargetProtein arginine N-methyltransferase 3 [N508S]
LigandBDBM50431676
Substrate/Competitorn/a
Meas. Tech.ChEMBL_951489 (CHEMBL2350642)
Ki 1150±n/a nM
Citation Yu, WSmil, DLi, FTempel, WFedorov, ONguyen, KTBolshan, YAl-Awar, RKnapp, SArrowsmith, CHVedadi, MBrown, PJSchapira, M Bromo-deaza-SAH: a potent and selective DOT1L inhibitor. Bioorg Med Chem21:1787-94 (2013) 
 
Protein arginine N-methyltransferase 3 [N508S]
Name:Protein arginine N-methyltransferase 3 [N508S]
Type:Protein
Mol. Mass.:59859.85
Organism:Homo sapiens (Human)
Description:O60678[N508S]
Residue:531
BDBM50431676
NameBDBM50431676
Synonyms:CHEMBL2349526
TypeSmall organic molecule
Emp. Form.C15H20BrN5O5S
Mol. Mass.462.319
SMILESN[C@@H](CCSC[C@H]1O[C@H]([C@H](O)[C@@H]1O)n1cc(Br)c2c(N)ncnc12)C(O)=O