Reaction Details
TargetCannabinoid receptor 1
LigandBDBM50431804
Substrate/Competitorn/a
Meas. Tech.ChEMBL_951850 (CHEMBL2353263)
Ki>40000±n/a nM
Citation Alvarado, MDecara, JLuque, MJHernandez-Folgado, LGómez-Cañas, MGómez-Ruiz, MFernández-Ruiz, JElguero, JJagerovic, NSerrano, AGoya, Pde Fonseca, FR Novel antiobesity agents: synthesis and pharmacological evaluation of analogues of Rimonabant and of LH21. Bioorg Med Chem21:1708-16 (2013) 
 
Cannabinoid receptor 1
Name:Cannabinoid receptor 1
Type:G Protein-Coupled Receptor (GPCR)
Mol. Mass.:52868.96
Organism:Homo sapiens (Human)
Description:P21554
Residue:472
BDBM50431804
NameBDBM50431804
Synonyms:CHEMBL2347044
TypeSmall organic molecule
Emp. Form.C32H45N3O
Mol. Mass.487.7192
(=O)c1cc(-c2ccccc2)n(n1)-c1ccccc1