Reaction Details
TargetCasein kinase I isoform alpha
LigandBDBM50432012
Substrate/Competitorn/a
Meas. Tech.ChEMBL_954191 (CHEMBL2351706)
IC50>10000±n/a nM
Citation Elagawany, MIbrahim, MAAli Ahmed, HEEl-Etrawy, AShGhiaty, AAbdel-Samii, ZKEl-Feky, SABajorath, J Design, synthesis, and molecular modelling of pyridazinone and phthalazinone derivatives as protein kinases inhibitors. Bioorg Med Chem Lett23:2007-13 (2013) 
 
Casein kinase I isoform alpha
Name:Casein kinase I isoform alpha
Type:PROTEIN
Mol. Mass.:14639.55
Organism:Sus scrofa
Description:ChEMBL_939731
Residue:125
BDBM50432012
NameBDBM50432012
Synonyms:CHEMBL2348731
TypeSmall organic molecule
Emp. Form.C14H18N4O
Mol. Mass.258.3189
SMILESCN1CCC(CC1)Nc1n[nH]c(=O)c2ccccc12