Reaction Details
TargetCannabinoid receptor 2
LigandBDBM50432190
Substrate/Competitorn/a
Meas. Tech.ChEMBL_950672 (CHEMBL2352675)
Ki 69±n/a nM
Citation Madadi, NRPenthala, NRBrents, LKFord, BMPrather, PLCrooks, PA Evaluation of (Z)-2-((1-benzyl-1H-indol-3-yl)methylene)-quinuclidin-3-one analogues as novel, high affinity ligands for CB1 and CB2 cannabinoid receptors. Bioorg Med Chem Lett23:2019-21 (2013) 
 
Cannabinoid receptor 2
Name:Cannabinoid receptor 2
Type:G Protein-Coupled Receptor (GPCR)
Mol. Mass.:39690.94
Organism:Homo sapiens (Human)
Description:P34972
Residue:360
BDBM50432190
NameBDBM50432190
Synonyms:CHEMBL2346980
TypeSmall organic molecule
Emp. Form.C23H23N3O
Mol. Mass.357.4482
SMILESO=NC1=C(Cc2cn(Cc3ccccc3)c3ccccc23)N2CCC1CC2