Reaction Details
TargetLactase/phlorizin hydrolase
LigandBDBM50432228
Substrate/Competitorn/a
Meas. Tech.ChEMBL_950939 (CHEMBL2350012)
IC50>200000±n/a nM
Citation Bian, XWang, QKe, CZhao, GLi, Y A new series of N2-substituted-5-(p-toluenesulfonylamino)phthalimide analogues asa-glucosidase inhibitors. Bioorg Med Chem Lett23:2022-6 (2013) 
 
Lactase/phlorizin hydrolase
Name:Lactase/phlorizin hydrolase
Type:PROTEIN
Mol. Mass.:217253.31
Organism:Rattus norvegicus
Description:ChEMBL_96426
Residue:1928
BDBM50432228
NameBDBM50432228
Synonyms:CHEMBL2347137
TypeSmall organic molecule
Emp. Form.C22H18N2O4S
Mol. Mass.406.454
SMILESCc1ccc(cc1)S(=O)(=O)Nc1ccc2C(=O)N(Cc3ccccc3)C(=O)c2c1