Reaction Details
TargetCytochrome P450 2C9
LigandBDBM50387084
Substrate/Competitorn/a
Meas. Tech.ChEMBL_950950 (CHEMBL2350276)
IC50 59500±n/a nM
Citation Amblard, FZhang, HZhou, LShi, JBobeck, DRNettles, JHChavre, SMcBrayer, TRTharnish, PWhitaker, TCoats, SJSchinazi, RF Synthesis and evaluation of non-dimeric HCV NS5A inhibitors. Bioorg Med Chem Lett23:2031-4 (2013) 
 
Cytochrome P450 2C9
Name:Cytochrome P450 2C9
Type:Enzyme
Mol. Mass.:55636.33
Organism:Homo sapiens (Human)
Description:P11712
Residue:490
BDBM50387084
NameBDBM50387084
Synonyms:BMS-790052 | DACLATASVIR
TypeSmall organic molecule
Emp. Form.C40H50N8O6
Mol. Mass.738.875
SMILESCOC(=O)N[C@@H](C(C)C)C(=O)N1CCC[C@H]1c1nc(c[nH]1)-c1ccc(cc1)-c1ccc(cc1)-c1c[nH]c(n1)[C@@H]1CCCN1C(=O)[C@@H](NC(=O)OC)C(C)C