Reaction Details
TargetCytochrome P450 2D6
LigandBDBM50432236
Substrate/Competitorn/a
Meas. Tech.ChEMBL_950949 (CHEMBL2350275)
IC50>100000±n/a nM
Citation Amblard, FZhang, HZhou, LShi, JBobeck, DRNettles, JHChavre, SMcBrayer, TRTharnish, PWhitaker, TCoats, SJSchinazi, RF Synthesis and evaluation of non-dimeric HCV NS5A inhibitors. Bioorg Med Chem Lett23:2031-4 (2013) 
 
Cytochrome P450 2D6
Name:Cytochrome P450 2D6
Type:Protein
Mol. Mass.:55774.82
Organism:Homo sapiens (Human)
Description:P10635
Residue:497
BDBM50432236
NameBDBM50432236
Synonyms:CHEMBL2347159
TypeSmall organic molecule
Emp. Form.C20H25N7O3
Mol. Mass.411.4576
SMILESCOC(=O)N[C@@H](C(C)C)C(=O)N1CCC[C@H]1c1nc(c[nH]1)-c1ccc(cc1)N=[N+]=[N-]