Reaction Details
TargetProstaglandin G/H synthase 1
LigandBDBM11639
Substrate/Competitorn/a
Meas. Tech.ChEMBL_951244 (CHEMBL2353245)
IC50 6650±n/a nM
Citation Assadieskandar, AAmirhamzeh, ASalehi, MOzadali, KOstad, SNShafiee, AAmini, M Synthesis, cyclooxygenase inhibitory effects, and molecular modeling study of 4-aryl-5-(4-(methylsulfonyl)phenyl)-2-alkylthio and -2-alkylsulfonyl-1H-imidazole derivatives. Bioorg Med Chem21:2355-62 (2013) 
 
Prostaglandin G/H synthase 1
Name:Prostaglandin G/H synthase 1
Type:Enzyme
Mol. Mass.:68692.62
Organism:Homo sapiens (Human)
Description:P23219
Residue:599
BDBM11639
NameBDBM11639
Synonyms:4-[5-(4-methylphenyl)-3-(trifluoromethyl)-1H-pyrazol-1-yl]benzene-1-sulfonamide CLX Celecoxib US11478464, Compound Celecoxib US8741944, Comparative Compound cid_2662
TypeSmall organic molecule
Emp. Form.C17H14F3N3O2S
Mol. Mass.381.372
SMILESCc1ccc(cc1)-c1cc(nn1-c1ccc(cc1)S(N)(=O)=O)C(F)(F)F