Reaction Details
TargetFarnesyl pyrophosphate synthase
LigandBDBM25270
Substrate/Competitorn/a
Meas. Tech.ChEMBL_951592 (CHEMBL2351267)
IC50>10000±n/a nM
Citation Leung, CYLangille, AMMancuso, JTsantrizos, YS Discovery of thienopyrimidine-based inhibitors of the human farnesyl pyrophosphate synthase--parallel synthesis of analogs via a trimethylsilyl ylidene intermediate. Bioorg Med Chem21:2229-40 (2013) 
 
Farnesyl pyrophosphate synthase
Name:Farnesyl pyrophosphate synthase
Type:Enzyme
Mol. Mass.:48272.89
Organism:Homo sapiens (Human)
Description:P14324
Residue:419
BDBM25270
NameBDBM25270
Synonyms:[(6E,11E)-2,6,12,16-tetramethyl-9-phosphonoheptadeca-2,6,11,15-tetraen-9-yl]phosphonic acid | bisphosphonate, 5
TypeSmall organic molecule
Emp. Form.C21H38O6P2
Mol. Mass.448.4703
SMILES[#6]\[#6](-[#6])=[#6]\[#6]-[#6]\[#6](-[#6])=[#6]\[#6]C([#6]\[#6]=[#6](/[#6])-[#6]-[#6]\[#6]=[#6](\[#6])-[#6])(P([#8])([#8])=O)P([#8])([#8])=O