Reaction Details
TargetGamma-aminobutyric acid receptor subunit alpha-1/beta-2/gamma-2
LigandBDBM50432382
Substrate/Competitorn/a
Meas. Tech.ChEMBL_952517 (CHEMBL2353552)
Ki 0.450000±n/a nM
Citation Guerrini, GCiciani, GCostanzo, ADaniele, SMartini, CGhelardini, CDi Cesare Mannelli, LCiattini, S Synthesis of novel cognition enhancers with pyrazolo[5,1-c][1,2,4]benzotriazine core acting at¿-aminobutyric acid type A (GABA(A)) receptor. Bioorg Med Chem21:2186-98 (2013) 
 
Gamma-aminobutyric acid receptor subunit alpha-1/beta-2/gamma-2
Name:Gamma-aminobutyric acid receptor subunit alpha-1/beta-2/gamma-2
Type:Protein
Mol. Mass.:n/a
Description:n/a
Components:This complex has 3 components.
Component 1
Name:Gamma-aminobutyric acid receptor subunit alpha-1
Synonyms:Benzodiazepine central GABA A Benzodiazepine liver GABA(A) receptor subunit alpha-1 GABA-A receptor GBRA1_HUMAN TBPS | agonist GABA site
Type:Protein
Mol. Mass.:51817.35
Organism:Homo sapiens (Human)
Description:P14867
Residue:456
Component 2
Name:Gamma-aminobutyric acid receptor subunit beta-2
Synonyms:GABA(A) receptor subunit beta-2 GBRB2_HUMAN
Type:PROTEIN
Mol. Mass.:59167.91
Organism:Homo sapiens (Human)
Description:EBI_221
Residue:512
Component 3
Name:Gamma-aminobutyric acid receptor subunit gamma-2
Synonyms:GABA(A) receptor subunit gamma-2 GBRG2_HUMAN
Type:PROTEIN
Mol. Mass.:54172.74
Organism:Homo sapiens (Human)
Description:EBI_217
Residue:467
BDBM50432382
NameBDBM50432382
Synonyms:CHEMBL2348441
TypeSmall organic molecule
Emp. Form.C15H11IN6O
Mol. Mass.418.1919
SMILES[O-][n+]1nc2c(I)cnn2c2cc(NCc3cccnc3)ccc12