Reaction Details
TargetMacrophage colony-stimulating factor 1 receptor
LigandBDBM50399537
Substrate/Competitorn/a
Meas. Tech.ChEMBL_953145 (CHEMBL2353584)
IC50 10.0±n/a nM
Citation Miyamoto, NSakai, NHirayama, TMiwa, KOguro, YOki, HOkada, KTakagi, TIwata, HAwazu, YYamasaki, STakeuchi, TMiki, HHori, AImamura, S Discovery of N-[5-({2-[(cyclopropylcarbonyl)amino]imidazo[1,2-b]pyridazin-6-yl}oxy)-2-methylphenyl]-1,3-dimethyl-1H-pyrazole-5-carboxamide (TAK-593), a highly potent VEGFR2 kinase inhibitor. Bioorg Med Chem21:2333-45 (2013) 
 
Macrophage colony-stimulating factor 1 receptor
Name:Macrophage colony-stimulating factor 1 receptor
Type:Protein
Mol. Mass.:107979.48
Organism:Homo sapiens (Human)
Description:P07333
Residue:972
BDBM50399537
NameBDBM50399537
Synonyms:CHEMBL2180604
TypeSmall organic molecule
Emp. Form.C23H23N7O3
Mol. Mass.445.4738
SMILESCc1cc(C(=O)Nc2cc(Oc3ccc4nc(NC(=O)C5CC5)cn4n3)ccc2C)n(C)n1