Reaction Details
TargetVascular endothelial growth factor receptor 2
LigandBDBM50402339
Substrate/Competitorn/a
Meas. Tech.ChEMBL_953170 (CHEMBL2353609)
IC50 49±n/a nM
Citation Miyamoto, NSakai, NHirayama, TMiwa, KOguro, YOki, HOkada, KTakagi, TIwata, HAwazu, YYamasaki, STakeuchi, TMiki, HHori, AImamura, S Discovery of N-[5-({2-[(cyclopropylcarbonyl)amino]imidazo[1,2-b]pyridazin-6-yl}oxy)-2-methylphenyl]-1,3-dimethyl-1H-pyrazole-5-carboxamide (TAK-593), a highly potent VEGFR2 kinase inhibitor. Bioorg Med Chem21:2333-45 (2013) 
 
Vascular endothelial growth factor receptor 2
Name:Vascular endothelial growth factor receptor 2
Type:Receptor Tyrosine Kinase
Mol. Mass.:151510.97
Organism:Homo sapiens (Human)
Description:P35968
Residue:1356
BDBM50402339
NameBDBM50402339
Synonyms:CHEMBL2206666
TypeSmall organic molecule
Emp. Form.C20H13F3N4O2
Mol. Mass.398.338
SMILESFC(F)(F)c1cccc(c1)C(=O)Nc1cccc(Oc2ccc3nccn3n2)c1