Reaction Details
TargetVascular endothelial growth factor receptor 2
LigandBDBM50432409
Substrate/Competitorn/a
Meas. Tech.ChEMBL_953174 (CHEMBL2353613)
IC50 1.3±n/a nM
Citation Miyamoto, NSakai, NHirayama, TMiwa, KOguro, YOki, HOkada, KTakagi, TIwata, HAwazu, YYamasaki, STakeuchi, TMiki, HHori, AImamura, S Discovery of N-[5-({2-[(cyclopropylcarbonyl)amino]imidazo[1,2-b]pyridazin-6-yl}oxy)-2-methylphenyl]-1,3-dimethyl-1H-pyrazole-5-carboxamide (TAK-593), a highly potent VEGFR2 kinase inhibitor. Bioorg Med Chem21:2333-45 (2013) 
 
Vascular endothelial growth factor receptor 2
Name:Vascular endothelial growth factor receptor 2
Type:Receptor Tyrosine Kinase
Mol. Mass.:151510.97
Organism:Homo sapiens (Human)
Description:P35968
Residue:1356
BDBM50432409
NameBDBM50432409
Synonyms:CHEMBL2348999
TypeSmall organic molecule
Emp. Form.C20H18N8O3
Mol. Mass.418.4087
SMILESCn1nncc1C(=O)Nc1cccc(Oc2ccc3nc(NC(=O)C4CC4)cn3n2)c1