Reaction Details
TargetVascular endothelial growth factor receptor 2
LigandBDBM50432399
Substrate/Competitorn/a
Meas. Tech.ChEMBL_953174 (CHEMBL2353613)
IC50 1.000000±n/a nM
Citation Miyamoto, NSakai, NHirayama, TMiwa, KOguro, YOki, HOkada, KTakagi, TIwata, HAwazu, YYamasaki, STakeuchi, TMiki, HHori, AImamura, S Discovery of N-[5-({2-[(cyclopropylcarbonyl)amino]imidazo[1,2-b]pyridazin-6-yl}oxy)-2-methylphenyl]-1,3-dimethyl-1H-pyrazole-5-carboxamide (TAK-593), a highly potent VEGFR2 kinase inhibitor. Bioorg Med Chem21:2333-45 (2013) 
 
Vascular endothelial growth factor receptor 2
Name:Vascular endothelial growth factor receptor 2
Type:Receptor Tyrosine Kinase
Mol. Mass.:151510.97
Organism:Homo sapiens (Human)
Description:P35968
Residue:1356
BDBM50432399
NameBDBM50432399
Synonyms:CHEMBL2349006
TypeSmall organic molecule
Emp. Form.C23H18FN5O3
Mol. Mass.431.4191
SMILESFc1cccc(c1)C(=O)Nc1cccc(Oc2ccc3nc(NC(=O)C4CC4)cn3n2)c1