Reaction Details
TargetSigma non-opioid intracellular receptor 1
LigandBDBM50058020
Substrate/Competitorn/a
Meas. Tech.ChEMBL_949952 (CHEMBL2352307)
Ki 0.670000±n/a nM
Citation Li, YWang, XZhang, JDeuther-Conrad, WXie, FZhang, XLiu, JQiao, JCui, MSteinbach, JBrust, PLiu, BJia, H Synthesis and evaluation of novel (18)F-labeled spirocyclic piperidine derivatives ass1 receptor ligands for positron emission tomography imaging. J Med Chem56:3478-91 (2013) 
 
Sigma non-opioid intracellular receptor 1
Name:Sigma non-opioid intracellular receptor 1
Type:Enzyme Catalytic Domain
Mol. Mass.:25124.85
Organism:Homo sapiens (Human)
Description:Q99720
Residue:223
BDBM50058020
NameBDBM50058020
Synonyms:4-[1-((E)-3-Iodo-allyl)-piperidin-4-ylmethoxy]-benzonitrile CHEMBL274585
TypeSmall organic molecule
Emp. Form.C16H19IN2O
Mol. Mass.382.2393
SMILESI\C=C\CN1CCC(COc2ccc(cc2)C#N)CC1