Reaction Details
TargetCytochrome P450 1A2
LigandBDBM50432670
Substrate/Competitorn/a
Meas. Tech.ChEMBL_951968 (CHEMBL2354045)
Ki 71±n/a nM
Citation Liu, JTaylor, SFDupart, PSArnold, CLSridhar, JJiang, QWang, YSkripnikova, EVZhao, MForoozesh, M Pyranoflavones: a group of small-molecule probes for exploring the active site cavities of cytochrome P450 enzymes 1A1, 1A2, and 1B1. J Med Chem56:4082-92 (2013) 
 
Cytochrome P450 1A2
Name:Cytochrome P450 1A2
Type:Enzyme
Mol. Mass.:58423.38
Organism:Homo sapiens (Human)
Description:P05177
Residue:516
BDBM50432670
NameBDBM50432670
Synonyms:CHEMBL2347914
TypeSmall organic molecule
Emp. Form.C18H12O4
Mol. Mass.292.2855
SMILESOc1cc(oc2cccc(=O)c12)-c1cccc(OCC#C)c1