Reaction Details
TargetPeptidyl-prolyl cis-trans isomerase FKBP1A
LigandBDBM50432735
Substrate/Competitorn/a
Meas. Tech.ChEMBL_952909 (CHEMBL2351898)
Ki 2100±n/a nM
Citation Wang, YKirschner, AFabian, AKGopalakrishnan, RKress, CHoogeland, BKoch, UKozany, CBracher, AHausch, F Increasing the efficiency of ligands for FK506-binding protein 51 by conformational control. J Med Chem56:3922-35 (2013) 
 
Peptidyl-prolyl cis-trans isomerase FKBP1A
Name:Peptidyl-prolyl cis-trans isomerase FKBP1A
Type:Isomerase
Mol. Mass.:11953.09
Organism:Homo sapiens (Human)
Description:P62942
Residue:108
BDBM50432735
NameBDBM50432735
Synonyms:CHEMBL2348608
TypeSmall organic molecule
Emp. Form.C24H26Cl2N2O6S
Mol. Mass.541.444
SMILESCOc1cc2CCN3C(=O)[C@@H]4CCCC(N4S(=O)(=O)c4cc(Cl)c(O)c(Cl)c4)[C@@]3(C)c2c(OC)c1