Reaction Details
TargetPeptidyl-prolyl cis-trans isomerase FKBP1A
LigandBDBM50432737
Substrate/Competitorn/a
Meas. Tech.ChEMBL_952909 (CHEMBL2351898)
Ki 27700±n/a nM
Citation Wang, YKirschner, AFabian, AKGopalakrishnan, RKress, CHoogeland, BKoch, UKozany, CBracher, AHausch, F Increasing the efficiency of ligands for FK506-binding protein 51 by conformational control. J Med Chem56:3922-35 (2013) 
 
Peptidyl-prolyl cis-trans isomerase FKBP1A
Name:Peptidyl-prolyl cis-trans isomerase FKBP1A
Type:Isomerase
Mol. Mass.:11953.09
Organism:Homo sapiens (Human)
Description:P62942
Residue:108
BDBM50432737
NameBDBM50432737
Synonyms:CHEMBL2348606
TypeSmall organic molecule
Emp. Form.C25H34N2O5
Mol. Mass.442.5479
SMILESCCC(C)(C)C(=O)C(=O)N1[C@H]2CCCC1[C@]1(C)N(CCc3cc(OC)cc(OC)c13)C2=O