Reaction Details
TargetPeptidyl-prolyl cis-trans isomerase FKBP1A
LigandBDBM50432738
Substrate/Competitorn/a
Meas. Tech.ChEMBL_952909 (CHEMBL2351898)
Ki 2800±n/a nM
Citation Wang, YKirschner, AFabian, AKGopalakrishnan, RKress, CHoogeland, BKoch, UKozany, CBracher, AHausch, F Increasing the efficiency of ligands for FK506-binding protein 51 by conformational control. J Med Chem56:3922-35 (2013) 
 
Peptidyl-prolyl cis-trans isomerase FKBP1A
Name:Peptidyl-prolyl cis-trans isomerase FKBP1A
Type:Isomerase
Mol. Mass.:11953.09
Organism:Homo sapiens (Human)
Description:P62942
Residue:108
BDBM50432738
NameBDBM50432738
Synonyms:CHEMBL2348605
TypeSmall organic molecule
Emp. Form.C28H38N2O5
Mol. Mass.482.6117
SMILESCOc1cc2CCN3C(=O)[C@@H]4CCCC(N4C(=O)C(=O)[C@]4(C)CCCC[C@H]4C)[C@@]3(C)c2c(OC)c1