Reaction Details
TargetPeptidyl-prolyl cis-trans isomerase FKBP1A
LigandBDBM50432739
Substrate/Competitorn/a
Meas. Tech.ChEMBL_952909 (CHEMBL2351898)
Ki 500±n/a nM
Citation Wang, YKirschner, AFabian, AKGopalakrishnan, RKress, CHoogeland, BKoch, UKozany, CBracher, AHausch, F Increasing the efficiency of ligands for FK506-binding protein 51 by conformational control. J Med Chem56:3922-35 (2013) 
 
Peptidyl-prolyl cis-trans isomerase FKBP1A
Name:Peptidyl-prolyl cis-trans isomerase FKBP1A
Type:Isomerase
Mol. Mass.:11953.09
Organism:Homo sapiens (Human)
Description:P62942
Residue:108
BDBM50432739
NameBDBM50432739
Synonyms:CHEMBL2348604
TypeSmall organic molecule
Emp. Form.C29H34N2O8
Mol. Mass.538.5889
SMILESCOc1cc2CCN3C(=O)[C@@H]4CCCC(N4C(=O)C(=O)c4cc(OC)c(OC)c(OC)c4)[C@@]3(C)c2c(OC)c1