Reaction Details
TargetPeptidyl-prolyl cis-trans isomerase FKBP5
LigandBDBM50432734
Substrate/Competitorn/a
Meas. Tech.ChEMBL_952910 (CHEMBL2351899)
Ki 7600±n/a nM
Citation Wang, YKirschner, AFabian, AKGopalakrishnan, RKress, CHoogeland, BKoch, UKozany, CBracher, AHausch, F Increasing the efficiency of ligands for FK506-binding protein 51 by conformational control. J Med Chem56:3922-35 (2013) 
 
Peptidyl-prolyl cis-trans isomerase FKBP5
Name:Peptidyl-prolyl cis-trans isomerase FKBP5
Type:PROTEIN
Mol. Mass.:51207.06
Organism:Homo sapiens (Human)
Description:ChEMBL_952910
Residue:457
BDBM50432734
NameBDBM50432734
Synonyms:CHEMBL2348592
TypeSmall organic molecule
Emp. Form.C23H26N2O8S2
Mol. Mass.522.591
SMILESCOc1ccc(OCCOC(=O)C2CCCCN2S(=O)(=O)c2ccc3[nH]c(=O)sc3c2)cc1OC