Reaction Details
TargetPeptidyl-prolyl cis-trans isomerase FKBP5
LigandBDBM50432748
Substrate/Competitorn/a
Meas. Tech.ChEMBL_952910 (CHEMBL2351899)
Ki 1200±n/a nM
Citation Wang, YKirschner, AFabian, AKGopalakrishnan, RKress, CHoogeland, BKoch, UKozany, CBracher, AHausch, F Increasing the efficiency of ligands for FK506-binding protein 51 by conformational control. J Med Chem56:3922-35 (2013) 
 
Peptidyl-prolyl cis-trans isomerase FKBP5
Name:Peptidyl-prolyl cis-trans isomerase FKBP5
Type:PROTEIN
Mol. Mass.:51207.06
Organism:Homo sapiens (Human)
Description:ChEMBL_952910
Residue:457
BDBM50432748
NameBDBM50432748
Synonyms:CHEMBL2348587
TypeSmall organic molecule
Emp. Form.C23H26Cl2N2O6S
Mol. Mass.529.433
SMILESCOc1ccc(OCCN2CC3CCCC(N3S(=O)(=O)c3cc(Cl)cc(Cl)c3)C2=O)cc1OC