Reaction Details
TargetFatty-acid amide hydrolase 1 [30-579]
LigandBDBM50432904
Substrate/Competitorn/a
Meas. Tech.ChEMBL_956683 (CHEMBL2379080)
IC50 7.5±n/a nM
Citation Ortar, GMorera, EDe Petrocellis, LLigresti, ASchiano Moriello, AMorera, LNalli, MRagno, RPirolli, ADi Marzo, V Biaryl tetrazolyl ureas as inhibitors of endocannabinoid metabolism: modulation at the N-portion and distal phenyl ring. Eur J Med Chem63:118-32 (2013) 
 
Fatty-acid amide hydrolase 1 [30-579]
Name:Fatty-acid amide hydrolase 1 [30-579]
Type:Single-pass membrane protein; homodimer
Mol. Mass.:60474.00
Organism:Rattus norvegicus (rat)
Description:P97612 (aa 30-579)
Residue:550
BDBM50432904
NameBDBM50432904
Synonyms:CHEMBL2376848
TypeSmall organic molecule
Emp. Form.C18H19N5O2
Mol. Mass.337.3758
SMILESCN(C)C(=O)n1nnc(Cc2ccc(cc2)-c2ccc(CO)cc2)n1