Reaction Details
TargetFatty-acid amide hydrolase 1 [30-579]
LigandBDBM50432906
Substrate/Competitorn/a
Meas. Tech.ChEMBL_956683 (CHEMBL2379080)
IC50 12±n/a nM
Citation Ortar, GMorera, EDe Petrocellis, LLigresti, ASchiano Moriello, AMorera, LNalli, MRagno, RPirolli, ADi Marzo, V Biaryl tetrazolyl ureas as inhibitors of endocannabinoid metabolism: modulation at the N-portion and distal phenyl ring. Eur J Med Chem63:118-32 (2013) 
 
Fatty-acid amide hydrolase 1 [30-579]
Name:Fatty-acid amide hydrolase 1 [30-579]
Type:Single-pass membrane protein; homodimer
Mol. Mass.:60474.00
Organism:Rattus norvegicus (rat)
Description:P97612 (aa 30-579)
Residue:550
BDBM50432906
NameBDBM50432906
Synonyms:CHEMBL2376846
TypeSmall organic molecule
Emp. Form.C19H19N5O3
Mol. Mass.365.3859
SMILESCOC(=O)c1cccc(c1)-c1ccc(Cc2nnn(n2)C(=O)N(C)C)cc1