Reaction Details
TargetMonoglyceride lipase
LigandBDBM50432902
Substrate/Competitorn/a
Meas. Tech.ChEMBL_956682 (CHEMBL2379079)
IC50 10.0±n/a nM
Citation Ortar, GMorera, EDe Petrocellis, LLigresti, ASchiano Moriello, AMorera, LNalli, MRagno, RPirolli, ADi Marzo, V Biaryl tetrazolyl ureas as inhibitors of endocannabinoid metabolism: modulation at the N-portion and distal phenyl ring. Eur J Med Chem63:118-32 (2013) 
 
Monoglyceride lipase
Name:Monoglyceride lipase
Type:Hydrolase
Mol. Mass.:33264.56
Organism:Homo sapiens (Human)
Description:Human recombinant MGL (Cayman Chemical, cat# 10008354).
Residue:303
BDBM50432902
NameBDBM50432902
Synonyms:CHEMBL2376850
TypeSmall organic molecule
Emp. Form.C17H17N5O2
Mol. Mass.323.3492
SMILESCN(C)C(=O)n1nnc(Cc2ccc(cc2)-c2cccc(O)c2)n1