Reaction Details
TargetInhibitor of nuclear factor kappa-B kinase subunit beta
LigandBDBM25961
Substrate/Competitorn/a
Meas. Tech.ChEMBL_957967 (CHEMBL2378059)
IC50 23±n/a nM
Citation Huang, JJWu, XWJia, JMGuo, XKXue, XJiang, ZYZhang, SLZhang, XJSun, HPYou, QD Novel IKKß inhibitors discovery based on the co-crystal structure by using binding-conformation-based and ligand-based method. Eur J Med Chem63:269-78 (2013) 
 
Inhibitor of nuclear factor kappa-B kinase subunit beta
Name:Inhibitor of nuclear factor kappa-B kinase subunit beta
Type:Serine/threonine-protein kinase
Mol. Mass.:86554.39
Organism:Homo sapiens (Human)
Description:GST-tagged IKK-2 was expressed in High Five cells and purified.
Residue:756
BDBM25961
NameBDBM25961
Synonyms:2-[({3-[12-methyl-8-(methylamino)-3-thia-1,7,10-triazatricyclo[7.3.0.0^{2,6}]dodeca-2(6),4,7,9,11-pentaen-4-yl]phenyl}methyl)amino]acetamide | imidazothienopyrazine, 22e
TypeSmall organic molecule
Emp. Form.C19H20N6OS
Mol. Mass.380.467
SMILESCNc1nc2cc(sc2n2c(C)cnc12)-c1cccc(CNCC(N)=O)c1