Reaction Details
TargetInhibitor of nuclear factor kappa-B kinase subunit beta
LigandBDBM25944
Substrate/Competitorn/a
Meas. Tech.ChEMBL_957967 (CHEMBL2378059)
IC50 21±n/a nM
Citation Huang, JJWu, XWJia, JMGuo, XKXue, XJiang, ZYZhang, SLZhang, XJSun, HPYou, QD Novel IKKß inhibitors discovery based on the co-crystal structure by using binding-conformation-based and ligand-based method. Eur J Med Chem63:269-78 (2013) 
 
Inhibitor of nuclear factor kappa-B kinase subunit beta
Name:Inhibitor of nuclear factor kappa-B kinase subunit beta
Type:Serine/threonine-protein kinase
Mol. Mass.:86554.39
Organism:Homo sapiens (Human)
Description:GST-tagged IKK-2 was expressed in High Five cells and purified.
Residue:756
BDBM25944
NameBDBM25944
Synonyms:2-(3-{8-[(2-aminoethyl)amino]-12-methyl-3-thia-1,7,10-triazatricyclo[7.3.0.0^{2,6}]dodeca-2(6),4,7,9,11-pentaen-4-yl}phenyl)ethan-1-ol | imidazothienopyrazine, 14g
TypeSmall organic molecule
Emp. Form.C19H21N5OS
Mol. Mass.367.468
SMILESCc1cnc2c(NCCN)nc3cc(sc3n12)-c1cccc(CCO)c1