Reaction Details
TargetRAC-alpha serine/threonine-protein kinase
LigandBDBM50433043
Substrate/Competitorn/a
Meas. Tech.ChEMBL_955788 (CHEMBL2379605)
IC50 83±n/a nM
Citation Cheng, HHoffman, JELe, PTPairish, MKania, RFarrell, WBagrodia, SYuan, JSun, SZhang, EXiang, CDalvie, DRahavendran, SV Structure-based design, SAR analysis and antitumor activity of PI3K/mTOR dual inhibitors from 4-methylpyridopyrimidinone series. Bioorg Med Chem Lett23:2787-92 (2013) 
 
RAC-alpha serine/threonine-protein kinase
Name:RAC-alpha serine/threonine-protein kinase
Type:Enzyme
Mol. Mass.:55681.25
Organism:Homo sapiens (Human)
Description:P31749
Residue:480
BDBM50433043
NameBDBM50433043
Synonyms:CHEMBL2375961 | US8633204, 307
TypeSmall organic molecule
Emp. Form.C21H25N7O4
Mol. Mass.439.4677
SMILESCOc1ncc(cn1)-c1cc2c(C)nc(N)nc2n([C@@H]2CC[C@@H](CC2)OCC(N)=O)c1=O