Reaction Details
TargetSerine/threonine-protein kinase mTOR
LigandBDBM50380313
Substrate/Competitorn/a
Meas. Tech.ChEMBL_955789 (CHEMBL2379606)
Ki 16±n/a nM
Citation Cheng, HHoffman, JELe, PTPairish, MKania, RFarrell, WBagrodia, SYuan, JSun, SZhang, EXiang, CDalvie, DRahavendran, SV Structure-based design, SAR analysis and antitumor activity of PI3K/mTOR dual inhibitors from 4-methylpyridopyrimidinone series. Bioorg Med Chem Lett23:2787-92 (2013) 
 
Serine/threonine-protein kinase mTOR
Name:Serine/threonine-protein kinase mTOR
Type:Rapamycin target protein
Mol. Mass.:288917.12
Organism:Homo sapiens (Human)
Description:P42345
Residue:2549
BDBM50380313
NameBDBM50380313
Synonyms:CHEMBL1234354 | US8633204, 286
TypeSmall organic molecule
Emp. Form.C22H27N5O4
Mol. Mass.425.4809
SMILESCOc1ccc(cn1)-c1cc2c(C)nc(N)nc2n([C@H]2CC[C@@H](CC2)OCCO)c1=O