Reaction Details
TargetSerine/threonine-protein kinase mTOR
LigandBDBM50433041
Substrate/Competitorn/a
Meas. Tech.ChEMBL_955789 (CHEMBL2379606)
Ki 93±n/a nM
Citation Cheng, HHoffman, JELe, PTPairish, MKania, RFarrell, WBagrodia, SYuan, JSun, SZhang, EXiang, CDalvie, DRahavendran, SV Structure-based design, SAR analysis and antitumor activity of PI3K/mTOR dual inhibitors from 4-methylpyridopyrimidinone series. Bioorg Med Chem Lett23:2787-92 (2013) 
 
Serine/threonine-protein kinase mTOR
Name:Serine/threonine-protein kinase mTOR
Type:Rapamycin target protein
Mol. Mass.:288917.12
Organism:Homo sapiens (Human)
Description:P42345
Residue:2549
BDBM50433041
NameBDBM50433041
Synonyms:CHEMBL2375960 | US8633204, 306
TypeSmall organic molecule
Emp. Form.C20H25N7O3
Mol. Mass.411.4576
SMILESCc1nc(N)nc2n([C@@H]3CC[C@@H](CC3)OCC(N)=O)c(=O)c(cc12)-c1cnn(C)c1