Reaction Details
TargetInterleukin-5
LigandBDBM50433115
Substrate/Competitorn/a
Meas. Tech.ChEMBL_956594 (CHEMBL2380080)
IC50 15000±n/a nM
Citation Venkateswararao, ESharma, VKLee, KCRoh, EKim, YJung, SH Design and synthesis of novel chromenone derivatives as interleukin-5 inhibitors. Bioorg Med Chem21:2543-50 (2013) 
 
Interleukin-5
Name:Interleukin-5
Type:PROTEIN
Mol. Mass.:15414.97
Organism:Mus musculus
Description:ChEMBL_1464308
Residue:133
BDBM50433115
NameBDBM50433115
Synonyms:CHEMBL2377413
TypeSmall organic molecule
Emp. Form.C26H27NO4
Mol. Mass.417.4969
SMILESOC(CCc1coc2cccc(OCC3CCCCC3)c2c1=O)c1ccc(cc1)C#N