Reaction Details
TargetInterleukin-5
LigandBDBM50433118
Substrate/Competitorn/a
Meas. Tech.ChEMBL_956594 (CHEMBL2380080)
IC50 12000±n/a nM
Citation Venkateswararao, ESharma, VKLee, KCRoh, EKim, YJung, SH Design and synthesis of novel chromenone derivatives as interleukin-5 inhibitors. Bioorg Med Chem21:2543-50 (2013) 
 
Interleukin-5
Name:Interleukin-5
Type:PROTEIN
Mol. Mass.:15414.97
Organism:Mus musculus
Description:ChEMBL_1464308
Residue:133
BDBM50433118
NameBDBM50433118
Synonyms:CHEMBL2377404
TypeSmall organic molecule
Emp. Form.C25H28O4
Mol. Mass.392.4874
SMILESOC(CCc1coc2cccc(OCC3CCCCC3)c2c1=O)c1ccccc1