Reaction Details
TargetSterol O-acyltransferase 2
LigandBDBM50433212
Substrate/Competitorn/a
Meas. Tech.ChEMBL_957099 (CHEMBL2378564)
IC50 10.0±n/a nM
Citation Ohtawa, MYamazaki, HMatsuda, DOhshiro, TRudel, LLOmura, STomoda, HNagamitsu, T Synthesis and structure-activity relationship of pyripyropene A derivatives as potent and selective acyl-CoA:cholesterol acyltransferase 2 (ACAT2) inhibitors: part 2. Bioorg Med Chem Lett23:2659-62 (2013) 
 
Sterol O-acyltransferase 2
Name:Sterol O-acyltransferase 2
Type:Enzyme
Mol. Mass.:59912.75
Organism:Homo sapiens (Human)
Description:O75908
Residue:522
BDBM50433212
NameBDBM50433212
Synonyms:CHEMBL2375705
TypeSmall organic molecule
Emp. Form.C38H40N2O10
Mol. Mass.684.7316
SMILESCCC(=O)O[C@H]1CC[C@@]2(C)[C@@H](C[C@H](OC(=O)c3ccc(cc3)C#N)[C@@]3(C)Oc4cc(oc(=O)c4[C@H](O)[C@H]23)-c2cccnc2)[C@]1(C)COC(C)=O