Reaction Details
TargetBreakpoint cluster region protein/Tyrosine-protein kinase ABL1
LigandBDBM50433235
Substrate/Competitorn/a
Meas. Tech.ChEMBL_957284 (CHEMBL2378944)
IC50 2.3±n/a nM
Citation Pan, XWang, FZhang, YGao, HHu, ZWang, SZhang, J Design, synthesis and biological activities of Nilotinib derivates as antitumor agents. Bioorg Med Chem21:2527-34 (2013) 
 
Breakpoint cluster region protein/Tyrosine-protein kinase ABL1
Name:Breakpoint cluster region protein/Tyrosine-protein kinase ABL1
Type:Enzyme
Mol. Mass.:n/a
Description:n/a
Components:This complex has 2 components.
Component 1
Name:Tyrosine-protein kinase ABL1
Synonyms:ABL ABL1_HUMAN JTK7 Proto-oncogene tyrosine-protein kinase ABL1 Tyrosine-protein kinase ABL V-abl Abelson murine leukemia viral oncogene homolog 1 p150 | tyrosine-protein kinase ABL1 isoform a
Type:Enzyme
Mol. Mass.:122897.30
Organism:Homo sapiens (Human)
Description:P00519
Residue:1130
Component 2
Name:Breakpoint cluster region protein
Synonyms:BCR BCR_HUMAN Breakpoint cluster region protein | D22S11
Type:PROTEIN
Mol. Mass.:142824.75
Organism:Homo sapiens (Human)
Description:ChEMBL_305348
Residue:1271
BDBM50433235
NameBDBM50433235
Synonyms:CHEMBL2375972
TypeSmall organic molecule
Emp. Form.C27H28N6O3
Mol. Mass.484.5496
SMILESCOc1ccc(cc1Nc1nccc(n1)-c1cccnc1)C(=O)Nc1ccc(OCCN(C)C)cc1