Reaction Details
TargetDiacylglycerol O-acyltransferase 1
LigandBDBM50433276
Substrate/Competitorn/a
Meas. Tech.ChEMBL_957845 (CHEMBL2378958)
IC50>10000±n/a nM
Citation Barlind, JGBuckett, LKCrosby, SGDavidsson, ÖEmtenäs, HErtan, AJurva, ULemurell, MGutierrez, PMNilsson, KO'Mahony, GPetersson, AURedzic, AWågberg, FYuan, ZQ Identification and design of a novel series of MGAT2 inhibitors. Bioorg Med Chem Lett23:2721-6 (2013) 
 
Diacylglycerol O-acyltransferase 1
Name:Diacylglycerol O-acyltransferase 1
Type:Protein
Mol. Mass.:55297.82
Organism:Homo sapiens (Human)
Description:O75907
Residue:488
BDBM50433276
NameBDBM50433276
Synonyms:CHEMBL2376316
TypeSmall organic molecule
Emp. Form.C19H21F2N3O3S
Mol. Mass.409.45
SMILESCCC1(CC)CNc2ccc(cc2C(=O)N1)S(=O)(=O)Nc1ccc(F)cc1F